Information:Gradle tasks [:app:generateDebugSources,
:app:mockableAndroidJar, :app:prepareDebugUnitTestDependencies,
:app:generateDebugAndroidTestSources]
Error:java.util.concurrent.ExecutionException: com.android.ide.common.process.ProcessException:
Error:Execution failed for task ':app:mergeDebugResources'.
> Error: java.util.concurrent.ExecutionException: com.android.ide.common.process.ProcessException:
Information:BUILD FAILED
Information:Total time: 4.809 secs
Information:2 errors
Information:0 warnings
Information:See complete output in console
-----------------------------------------------------------------
Android studio 업데이트 후 Gradle 빌드 에러가 자주 발생하는데...
이런 문제는 대부분 빌드 환경이 업데이트 될때 발생한다.
Android studio 버전 업데이트나 플러그인 업데이트 등을 했다면
SDK Manager를 실행하여 반드시 빌드 툴 버전등을 같이 업데이트 하자.
그리고 프로젝트 속성에서 빌드 툴 버전도 최신 버전으로 변경하자.
-----------------------------------------------------------------
위의 에러가 발생한 근본 원인은 nine patch로 제작되지 않은 png 파일이 xxxxx.9.png로 drawable resource로 추가되어 발생하였다.
-----------------------------------------------------------------
또는 다른 글에서는 프로젝트 파일(리소스)의 경로 길이가 255 글자 이상이 될 경우에도 발생한다고 한다.
'programmer > android' 카테고리의 다른 글
Custom Switch Bug (0) | 2017.02.22 |
---|---|
GridView row height (0) | 2017.01.25 |
AAR library in Android Studio (0) | 2016.10.18 |
Touch Event and Smooth drag (0) | 2016.08.17 |
GridView dynamic height (0) | 2014.04.29 |